Target
Mu-type opioid receptor
Ligand
BDBM50474153
Substrate
Meas. Tech.
ChEMBL_145450 (CHEMBL752039)
Ki
13±n/a nM
Citation
 Takayama, HIshikawa, HKurihara, MKitajima, MAimi, NPonglux, DKoyama, FMatsumoto, KMoriyama, TYamamoto, LTWatanabe, KMurayama, THorie, S Studies on the synthesis and opioid agonistic activities of mitragynine-related indole alkaloids: discovery of opioid agonists structurally different from other opioid ligands. J Med Chem 45:1949-56 (2002)  
Target
Name:
Mu-type opioid receptor
Synonyms:
M-OR-1 Mu opioid receptor OPIATE Mu OPRM_CAVPO
Type:
Enzyme Catalytic Domain
Mol. Mass.:
11165.58
Organism:
GUINEA PIG
Description:
P97266
Residue:
98
  
Inhibitor
Name:
BDBM50474153
Synonyms:
CHEMBL61630
Type:
Small organic molecule
Emp. Form.:
C23H30N2O5
Mol. Mass.:
414.4947
SMILES:
[H][C@@]12C[C@@H]([C@H](CC)CN1CC[C@@]1(O)C2=Nc2cccc(OC)c12)C(=C/OC)\C(=O)OC
: