Target
5-hydroxytryptamine receptor 2C
Ligand
BDBM50474415
Substrate
Meas. Tech.
ChEMBL_2752 (CHEMBL617749)
Ki
16±n/a nM
Citation
 Vázquez, MJRoa, AMReyes, FVega, ARivera-Sagredo, AThomas, DRDíez, EHueso-Rodríguez, JA A novel ergot alkaloid as a 5-HT(1A) inhibitor produced by Dicyma sp. J Med Chem 46:5117-20 (2003)  
Target
Name:
5-hydroxytryptamine receptor 2C
Synonyms:
5-HT-2C 5-HT2C-INI 5-HTR2C 5-hydroxytryptamine receptor 2C (5-HT-2C) 5HT-1C HTR1C Serotonin (5-HT3) receptor Serotonin Receptor 2C
Type:
G Protein-Coupled Receptor (GPCR)
Mol. Mass.:
51836.79
Organism:
Homo sapiens (Human)
Description:
P28335
Residue:
458
  
Inhibitor
Name:
BDBM50474415
Synonyms:
CHEMBL2112882
Type:
Small organic molecule
Emp. Form.:
C34H39N5O5
Mol. Mass.:
597.704
SMILES:
[H][C@@]12Cc3c[nH]c4cccc(C1=C[C@H](CN2C)C(=O)N[C@]1(C)O[C@@]2(O)[C@H](Cc5ccccc5)NC(=O)[C@H](CC(C)C)N2C1=O)c34
: