Target
DNA gyrase subunit A/B
Ligand
BDBM50223588
Substrate
Meas. Tech.
ChEMBL_50463 (CHEMBL657333)
IC50
>383000±n/a nM
Citation
 Tanitame, AOyamada, YOfuji, KFujimoto, MIwai, NHiyama, YSuzuki, KIto, HTerauchi, HKawasaki, MNagai, KWachi, MYamagishi, J Synthesis and antibacterial activity of a novel series of potent DNA gyrase inhibitors. Pyrazole derivatives. J Med Chem 47:3693-6 (2004)  
Target
Name:
DNA gyrase subunit A/B
Synonyms:
DNA Gyrase | DNA gyrase A/B
Type:
A2B2 tetramer
Mol. Mass.:
Description:
Components:
This complex has 2 components.
Component 1
Name:
DNA gyrase subunit A
Synonyms:
DNA gyrase GYRA_ECOLI hisW parD
Type:
Enzyme Subunit
Mol. Mass.:
96935.15
Organism:
Escherichia coli (strain K12)
Description:
Residue:
875
  
Component 2
Name:
DNA gyrase subunit B
Synonyms:
DNA gyrase subunit B GYRB_ECOLI acrB gyrB hisU parA | pcbA
Type:
Enzyme Subunit
Mol. Mass.:
89941.28
Organism:
Escherichia coli (strain K12)
Description:
P0AES6
Residue:
804
  
Inhibitor
Name:
BDBM50223588
Synonyms:
CHEMBL330372 | DNDI1417460
Type:
Small organic molecule
Emp. Form.:
C21H23N3O
Mol. Mass.:
333.4268
SMILES:
C(Oc1ccc(cc1)-c1cc([nH]n1)C1CCNCC1)c1ccccc1
: