Target
Prostaglandin G/H synthase 2
Ligand
BDBM11639
Substrate
Meas. Tech.
ChEMBL_157824 (CHEMBL769428)
IC50
52.4±n/a nM
Citation
 Shin, SSByun, YLim, KMChoi, JKLee, KWMoh, JHKim, JKJeong, YSKim, JYChoi, YHKoh, HJPark, YHOh, YINoh, MSChung, S In vitro structure-activity relationship and in vivo studies for a novel class of cyclooxygenase-2 inhibitors: 5-aryl-2,2-dialkyl-4-phenyl-3(2H)furanone derivatives. J Med Chem 47:792-804 (2004)  
Target
Name:
Prostaglandin G/H synthase 2
Synonyms:
Cox-2 Cyclooxygenase-2 Glucocorticoid-regulated inflammatory cyclooxygenase Macrophage activation-associated marker protein P71/73 PGH synthase 2 PGHS-2 Pghs-b Prostaglandin H2 synthase 2 Ptgs2 Tis10
Type:
Protein
Mol. Mass.:
69020.39
Organism:
Mus musculus (Mouse)
Description:
Q05769
Residue:
604
  
Inhibitor
Name:
BDBM11639
Synonyms:
4-[5-(4-methylphenyl)-3-(trifluoromethyl)-1H-pyrazol-1-yl]benzene-1-sulfonamide CLX Celecoxib US11478464, Compound Celecoxib US8741944, Comparative Compound cid_2662
Type:
Small organic molecule
Emp. Form.:
C17H14F3N3O2S
Mol. Mass.:
381.372
SMILES:
Cc1ccc(cc1)-c1cc(nn1-c1ccc(cc1)S(N)(=O)=O)C(F)(F)F
: