Target
Mitogen-activated protein kinase 11/12/13/14
Ligand
BDBM50474810
Substrate
Meas. Tech.
ChEMBL_89070 (CHEMBL698857)
IC50
0.800000±n/a nM
Citation
 Clark, MPLaughlin, SKLaufersweiler, MJBookland, RGBrugel, TAGolebiowski, ASabat, MPTownes, JAVanRens, JCDjung, JFNatchus, MGDe, BHsieh, LCXu, SCWalter, RLMekel, MJHeitmeyer, SABrown, KKJuergens, KTaiwo, YOJanusz, MJ Development of orally bioavailable bicyclic pyrazolones as inhibitors of tumor necrosis factor-alpha production. J Med Chem 47:2724-7 (2004)  
Target
Name:
Mitogen-activated protein kinase 11/12/13/14
Synonyms:
MAP kinase p38
Type:
Mol. Mass.:
Description:
ASSAY_ID of ChEMBL is 1935922
Components:
This complex has 4 components.
Component 1
Name:
Mitogen-activated protein kinase 13
Synonyms:
MAP kinase p38 delta MK13_HUMAN Mitogen-activated protein kinase 13 (MAPK13) Mitogen-activated protein kinase p38 delta SAPK4 p38 delta/gamma
Type:
Enzyme
Mol. Mass.:
42097.16
Organism:
Homo sapiens (Human)
Description:
O15264
Residue:
365
  
Component 2
Name:
Mitogen-activated protein kinase 11
Synonyms:
MAP kinase p38 MK11_HUMAN Mitogen-activated protein kinase p38 beta SAPK2 Stress-activated protein kinase 2 p38-2 p38b
Type:
Enzyme Catalytic Domain
Mol. Mass.:
41351.73
Organism:
Homo sapiens (Human)
Description:
gi_20128774
Residue:
364
  
Component 3
Name:
Mitogen-activated protein kinase 14
Synonyms:
CSAID-binding protein CSBP1 CSPB1 MAP kinase 14 MAP kinase p38 alpha MAPK14 MK14_HUMAN Mitogen-activated protein kinase p38 alpha Stress-activated protein kinase 2a | p38 MAP kinase alpha/beta
Type:
Serine/threonine-protein kinase
Mol. Mass.:
41286.76
Organism:
Homo sapiens (Human)
Description:
Q16539
Residue:
360
  
Component 4
Name:
Mitogen-activated protein kinase 12
Synonyms:
ERK6 MAPK12 Mitogen-activated protein kinase 12 (MAPK12 p38 gamma) Mitogen-activated protein kinase 12 Gamma SAPK3 | p38 delta/gamma
Type:
Protein
Mol. Mass.:
41938.69
Organism:
Homo sapiens (Human)
Description:
P53778
Residue:
367
  
Inhibitor
Name:
BDBM50474810
Synonyms:
CHEMBL92082
Type:
Small organic molecule
Emp. Form.:
C24H22FN5O
Mol. Mass.:
415.4628
SMILES:
C[C@H](Nc1nccc(n1)-c1c(-c2ccc(F)cc2)c(=O)n2CCCn12)c1ccccc1
: