Target
Small conductance calcium-activated potassium channel protein 1/2/3
Ligand
BDBM50473106
Substrate
Meas. Tech.
ChEMBL_306799 (CHEMBL832384)
IC50
70±n/a nM
Citation
 Galanakis, DGanellin, CRChen, JQGunasekera, DDunn, PM Bis-quinolinium cyclophanes: toward a pharmacophore model for the blockade of apamin-sensitive SKCa channels in sympathetic neurons. Bioorg Med Chem Lett 14:4231-5 (2004)  
Target
Name:
Small conductance calcium-activated potassium channel protein 1/2/3
Synonyms:
Small conductance calcium-activated potassium channel
Type:
Mol. Mass.:
Description:
ASSAY_ID of ChEMBL is 1559987
Components:
This complex has 3 components.
Component 1
Name:
Small conductance calcium-activated potassium channel protein 3
Synonyms:
KCNN3_RAT SK3 | Small conductance calcium-activated potassium channel
Type:
PROTEIN
Mol. Mass.:
81476.29
Organism:
Rattus norvegicus
Description:
ChEMBL_494975
Residue:
732
  
Component 2
Name:
Small conductance calcium-activated potassium channel protein 1
Synonyms:
KCNN1_RAT Potassium Channel, Ca2+ Act., VS Small conductance calcium-activated potassium channel
Type:
Enzyme Catalytic Domain
Mol. Mass.:
59231.59
Organism:
RAT
Description:
Potassium Channel, Ca2+ Act., VS 0 RAT::P70606
Residue:
536
  
Component 3
Name:
Small conductance calcium-activated potassium channel protein 2
Synonyms:
KCNN2_RAT Small conductance calcium-activated potassium channel Small conductance calcium-activated potassium channel protein 2 (KCa2.2)
Type:
Protein
Mol. Mass.:
63876.72
Organism:
Rattus norvegicus (Rat)
Description:
P70604
Residue:
580
  
Inhibitor
Name:
BDBM50473106
Synonyms:
CHEMBL137175
Type:
Small organic molecule
Emp. Form.:
C34H30N4
Mol. Mass.:
494.6277
SMILES:
C1Nc2cc[n+](Cc3ccc(C[n+]4ccc(NCc5cccc1c5)c1ccccc41)cc3)c1ccccc21
: