Target
Progesterone receptor
Ligand
BDBM50474911
Substrate
Meas. Tech.
ChEMBL_304070 (CHEMBL839745)
Ki
40±n/a nM
Citation
 Jones, DGLiang, XStewart, ELNoe, RAKallander, LSMadauss, KPWilliams, SPThompson, SKGray, DWHoekstra, WJ Discovery of non-steroidal mifepristone mimetics: pyrazoline-based PR antagonists. Bioorg Med Chem Lett 15:3203-6 (2005)  
Target
Name:
Progesterone receptor
Synonyms:
NR3C3 PGR PRGR_HUMAN | progesterone
Type:
Protein
Mol. Mass.:
98979.52
Organism:
Homo sapiens (Human)
Description:
P06401
Residue:
933
  
Inhibitor
Name:
BDBM50474911
Synonyms:
CHEMBL192314
Type:
Small organic molecule
Emp. Form.:
C23H20Cl3N3O2S
Mol. Mass.:
508.848
SMILES:
CN(C)c1ccc(cc1)C1CN(N=C1c1ccc(Cl)c(Cl)c1)S(=O)(=O)c1ccc(Cl)cc1
: