Target
Progesterone receptor
Ligand
BDBM50474913
Substrate
Meas. Tech.
ChEMBL_309956 (CHEMBL837212)
Ki
5012±n/a nM
Citation
 Jones, DGLiang, XStewart, ELNoe, RAKallander, LSMadauss, KPWilliams, SPThompson, SKGray, DWHoekstra, WJ Discovery of non-steroidal mifepristone mimetics: pyrazoline-based PR antagonists. Bioorg Med Chem Lett 15:3203-6 (2005)  
Target
Name:
Progesterone receptor
Synonyms:
NR3C3 PGR PRGR_HUMAN | progesterone
Type:
Protein
Mol. Mass.:
98979.52
Organism:
Homo sapiens (Human)
Description:
P06401
Residue:
933
  
Inhibitor
Name:
BDBM50474913
Synonyms:
CHEMBL192859
Type:
Small organic molecule
Emp. Form.:
C16H13Cl3N2O2S
Mol. Mass.:
403.711
SMILES:
C[C@@H]1CN(N=C1c1ccc(Cl)c(Cl)c1)S(=O)(=O)c1ccc(Cl)cc1
: