Target
DNA polymerase catalytic subunit
Ligand
BDBM50027547
Substrate
Meas. Tech.
ChEBML_50629
IC50
>500000±n/a nM
Citation
 Norén, JOHelgstrand, EJohansson, NGMisiorny, AStening, G Synthesis of esters of phosphonoformic acid and their antiherpes activity. J Med Chem 26:264-70 (1983)  
Target
Name:
DNA polymerase catalytic subunit
Synonyms:
DPOL_HHV11 | Human herpesvirus 1 DNA polymerase
Type:
PROTEIN
Mol. Mass.:
136432.57
Organism:
Human herpesvirus 1 (strain 17) (HHV-1) (Human herpes simplex virus1)
Description:
ChEMBL_321605
Residue:
1235
  
Inhibitor
Name:
BDBM50027547
Synonyms:
CHEMBL90381 | methyl (1-adamantyloxy)(methoxy)phosphinecarboxylate oxide
Type:
Small organic molecule
Emp. Form.:
C13H21O5P
Mol. Mass.:
288.2766
SMILES:
COC(=O)P(=O)(OC)OC12CC3CC(CC(C3)C1)C2
: