Target
DNA polymerase catalytic subunit
Ligand
BDBM50027556
Substrate
Meas. Tech.
ChEBML_50629
IC50
39000±n/a nM
Citation
 Norén, JOHelgstrand, EJohansson, NGMisiorny, AStening, G Synthesis of esters of phosphonoformic acid and their antiherpes activity. J Med Chem 26:264-70 (1983)  
Target
Name:
DNA polymerase catalytic subunit
Synonyms:
DPOL_HHV11 | Human herpesvirus 1 DNA polymerase
Type:
PROTEIN
Mol. Mass.:
136432.57
Organism:
Human herpesvirus 1 (strain 17) (HHV-1) (Human herpes simplex virus1)
Description:
ChEMBL_321605
Residue:
1235
  
Inhibitor
Name:
BDBM50027556
Synonyms:
CHEMBL92173 | phenyl diphenoxyphosphinecarboxylate oxide
Type:
Small organic molecule
Emp. Form.:
C19H15O5P
Mol. Mass.:
354.2932
SMILES:
O=C(Oc1ccccc1)P(=O)(Oc1ccccc1)Oc1ccccc1
: