Target
DNA polymerase catalytic subunit
Ligand
BDBM50027564
Substrate
Meas. Tech.
ChEBML_50629
IC50
>500000±n/a nM
Citation
 Norén, JOHelgstrand, EJohansson, NGMisiorny, AStening, G Synthesis of esters of phosphonoformic acid and their antiherpes activity. J Med Chem 26:264-70 (1983)  
Target
Name:
DNA polymerase catalytic subunit
Synonyms:
DPOL_HHV11 | Human herpesvirus 1 DNA polymerase
Type:
PROTEIN
Mol. Mass.:
136432.57
Organism:
Human herpesvirus 1 (strain 17) (HHV-1) (Human herpes simplex virus1)
Description:
ChEMBL_321605
Residue:
1235
  
Inhibitor
Name:
BDBM50027564
Synonyms:
CHEMBL92306 | disodium ethoxycarbonylphosphonate
Type:
Small organic molecule
Emp. Form.:
C3H5O5P
Mol. Mass.:
152.0437
SMILES:
CCOC(=O)P([O-])([O-])=O
: