Target
DNA polymerase catalytic subunit
Ligand
BDBM50027565
Substrate
Meas. Tech.
ChEBML_50629
IC50
97000±n/a nM
Citation
 Norén, JOHelgstrand, EJohansson, NGMisiorny, AStening, G Synthesis of esters of phosphonoformic acid and their antiherpes activity. J Med Chem 26:264-70 (1983)  
Target
Name:
DNA polymerase catalytic subunit
Synonyms:
DPOL_HHV11 | Human herpesvirus 1 DNA polymerase
Type:
PROTEIN
Mol. Mass.:
136432.57
Organism:
Human herpesvirus 1 (strain 17) (HHV-1) (Human herpes simplex virus1)
Description:
ChEMBL_321605
Residue:
1235
  
Inhibitor
Name:
BDBM50027565
Synonyms:
CHEMBL91431 | phenyl (4-methoxyphenoxy)(ethoxy)phosphinecarboxylate oxide
Type:
Small organic molecule
Emp. Form.:
C16H17O6P
Mol. Mass.:
336.2763
SMILES:
CCOP(=O)(Oc1ccc(OC)cc1)C(=O)Oc1ccccc1
: