Target
DNA polymerase catalytic subunit
Ligand
BDBM50027575
Substrate
Meas. Tech.
ChEBML_50629
IC50
>500000±n/a nM
Citation
 Norén, JOHelgstrand, EJohansson, NGMisiorny, AStening, G Synthesis of esters of phosphonoformic acid and their antiherpes activity. J Med Chem 26:264-70 (1983)  
Target
Name:
DNA polymerase catalytic subunit
Synonyms:
DPOL_HHV11 | Human herpesvirus 1 DNA polymerase
Type:
PROTEIN
Mol. Mass.:
136432.57
Organism:
Human herpesvirus 1 (strain 17) (HHV-1) (Human herpes simplex virus1)
Description:
ChEMBL_321605
Residue:
1235
  
Inhibitor
Name:
BDBM50027575
Synonyms:
4-nitrophenyl dimethoxyphosphinecarboxylate oxide | CHEMBL314735
Type:
Small organic molecule
Emp. Form.:
C9H10NO7P
Mol. Mass.:
275.152
SMILES:
COP(=O)(OC)C(=O)Oc1ccc(cc1)[N+]([O-])=O
: