Target
Neuronal acetylcholine receptor subunit alpha-2/beta-2
Ligand
BDBM50106490
Substrate
Meas. Tech.
ChEMBL_320936 (CHEMBL882455)
Ki
0.037000±n/a nM
Citation
 Huang, YZhu, ZXiao, YLaruelle, M Epibatidine analogues as selective ligands for the alpha(x)beta2-containing subtypes of nicotinic acetylcholine receptors. Bioorg Med Chem Lett 15:4385-8 (2005)  
Target
Name:
Neuronal acetylcholine receptor subunit alpha-2/beta-2
Synonyms:
Neuronal acetylcholine receptor protein alpha-2/beta-2 subunit nAChR subtypes alpha2 beta2
Type:
Mol. Mass.:
Description:
ASSAY_ID of EBI is 143226
Components:
This complex has 2 components.
Component 1
Name:
Neuronal acetylcholine receptor subunit alpha-2
Synonyms:
ACHA2_RAT Cholinergic, Nicotinic Alpha2Beta2 Chrna2
Type:
Enzyme
Mol. Mass.:
58597.25
Organism:
Rattus norvegicus (Rat)
Description:
P12389
Residue:
511
  
Component 2
Name:
Neuronal acetylcholine receptor subunit beta-2
Synonyms:
ACHB2_RAT Chrnb2 Neuronal acetylcholine receptor non-alpha-1 chain
Type:
Enzyme
Mol. Mass.:
56910.32
Organism:
Rattus norvegicus (Rat)
Description:
P12390
Residue:
500
  
Inhibitor
Name:
BDBM50106490
Synonyms:
2-(6-Chloro-5-phenyl-pyridin-3-yl)-7-aza-bicyclo[2.2.1]heptane | CHEMBL291961
Type:
Small organic molecule
Emp. Form.:
C17H17ClN2
Mol. Mass.:
284.783
SMILES:
Clc1ncc(cc1-c1ccccc1)C1CC2CCC1N2
: