Target
Muscarinic acetylcholine receptor M2
Ligand
BDBM50092961
Substrate
Meas. Tech.
ChEMBL_442219 (CHEMBL892378)
Ki
0.159956±n/a nM
Citation
 Niu, YYYang, LMDeng, KMYao, JHZhu, LChen, CYZhang, MZhou, JEShen, TXChen, HZLu, Y Quantitative structure-selectivity relationship for M2 selectivity between M1 and M2 of piperidinyl piperidine derivatives as muscarinic antagonists. Bioorg Med Chem Lett 17:2260-6 (2007)  
Target
Name:
Muscarinic acetylcholine receptor M2
Synonyms:
ACM2_HUMAN Cholinergic, muscarinic M2 Muscarinic acetylcholine receptor M2 and M5 | RecName: Full=Muscarinic acetylcholine receptor M2
Type:
GPCR
Mol. Mass.:
51730.61
Organism:
Homo sapiens (Human)
Description:
P08172
Residue:
466
  
Inhibitor
Name:
BDBM50092961
Synonyms:
1-(isopropylsulfonyl)-4-(4-(1-(4-(4-methoxyphenylsulfonyl)phenyl)vinyl)piperidin-1-yl)piperidine CHEMBL73893
Type:
Small organic molecule
Emp. Form.:
C28H38N2O5S2
Mol. Mass.:
546.742
SMILES:
COc1ccc(cc1)S(=O)(=O)c1ccc(cc1)C(=C)C1CCN(CC1)C1CCN(CC1)S(=O)(=O)C(C)C
: