Target
Leukotriene B4 receptor 2
Ligand
BDBM50000541
Substrate
Meas. Tech.
ChEMBL_444217 (CHEMBL893371)
IC50
>100000±n/a nM
Citation
 Junek, RBr?nová, BKverka, MPanajotová, VJandera, AKuchar, M Antileukotrienic N-arylethyl-2-arylacetamides in the treatment of ulcerative colitis. Eur J Med Chem 42:1084-94 (2007)  
Target
Name:
Leukotriene B4 receptor 2
Synonyms:
BLT2R LT4R2_HUMAN LTB4-R 2 LTB4R2 Leukotriene B4 Leukotriene B4 receptor Leukotriene B4 receptor BLT2 Seven transmembrane receptor BLTR2
Type:
Enzyme Catalytic Domain
Mol. Mass.:
37964.86
Organism:
Homo sapiens (Human)
Description:
Leukotriene 2 0 HUMAN::Q9NPC1
Residue:
358
  
Inhibitor
Name:
BDBM50000541
Synonyms:
(+-)-1-(1-Benzo[b]thien-2-ylethyl)-1-hydroxyurea CHEMBL93 N-(1-Benzo(b)thien-2-ylethyl)-N-hydroxyurea ZILEUTON | Zyflo (TN)
Type:
Small organic molecule
Emp. Form.:
C11H12N2O2S
Mol. Mass.:
236.29
SMILES:
CC(N(O)C(N)=O)c1cc2ccccc2s1
: