Target
Substance-K receptor
Ligand
BDBM50476788
Substrate
Meas. Tech.
ChEMBL_446257 (CHEMBL895361)
Ki
0.052481±n/a nM
Citation
 Fedi, VAltamura, MCatalioto, RMGiannotti, DGiolitti, AGiuliani, SGuidi, AHarmat, NJLecci, AMeini, SNannicini, RPasqui, FTramontana, MTriolo, AMaggi, CA Discovery of a new series of potent and selective linear tachykinin NK2 receptor antagonists. J Med Chem 50:4793-807 (2007)  
Target
Name:
Substance-K receptor
Synonyms:
NK-2 receptor NK2R NKNAR Neurokinin A receptor Neurokinin-2 (NK-2) SKR TACR2 Tachykinin receptor 2 (NK2) | hnk-3
Type:
Protein
Mol. Mass.:
44455.78
Organism:
Homo sapiens (Human)
Description:
P21452
Residue:
398
  
Inhibitor
Name:
BDBM50476788
Synonyms:
CHEMBL243711
Type:
Small organic molecule
Emp. Form.:
C36H45ClN4O4S
Mol. Mass.:
665.285
SMILES:
Clc1ccc2cc(sc2c1)C(=O)NC1(CCCC1)C(=O)N[C@H](Cc1ccccc1)C(=O)NCC1CCN(CC2CCOCC2)CC1
: