Target
Protein kinase C zeta type
Ligand
BDBM50478561
Substrate
Meas. Tech.
ChEMBL_486812 (CHEMBL1018347)
IC50
35.2±n/a nM
Citation
 Sun, HHWhite, CBDedinas, JCooper, RSedlock, DM Methylpendolmycin, an indolactam from a Nocardiopsis sp. J Nat Prod 54:1440-3 
Target
Name:
Protein kinase C zeta type
Synonyms:
KPCZ_RAT Prkcz Protein kinase C zeta type | nPKC-zeta
Type:
PROTEIN
Mol. Mass.:
67722.31
Organism:
Rattus norvegicus
Description:
ChEMBL_104731
Residue:
592
  
Inhibitor
Name:
BDBM50478561
Synonyms:
CHEBI:69599 | Methylpendolmycin
Type:
Small organic molecule
Emp. Form.:
C23H33N3O2
Mol. Mass.:
383.527
SMILES:
[H][C@@]1([C@@H](C)CC)N(C)c2ccc(c3[nH]cc(C[C@@H](CO)NC1=O)c23)C(C)(C)C=C
: