Target
Integrase
Ligand
BDBM50477466
Substrate
Meas. Tech.
ChEMBL_455147 (CHEMBL887177)
IC50
28000±n/a nM
Citation
 Sriram, DYogeeswari, PSenchani, GBanerjee, D Newer tetracycline derivatives: synthesis, anti-HIV, antimycobacterial activities and inhibition of HIV-1 integrase. Bioorg Med Chem Lett 17:2372-5 (2007)  
Target
Name:
Integrase
Synonyms:
pol
Type:
PROTEIN
Mol. Mass.:
32203.43
Organism:
Human immunodeficiency virus 1
Description:
ChEMBL_106649
Residue:
288
  
Inhibitor
Name:
BDBM50477466
Synonyms:
CHEMBL392565
Type:
Small organic molecule
Emp. Form.:
C42H46FN5O13
Mol. Mass.:
847.8387
SMILES:
[H][C@@]12[C@@H](O)[C@@]3([H])C(C(=O)c4c(O)cccc4[C@@]3(C)O)=C(O)[C@]1(O)C(=O)C(C(=O)NCN1CCN(CC1C)c1c(F)cc3c(c1OC)n(cc(C(O)=O)c3=O)C1CC1)=C(O)[C@H]2N(C)C
: