Target
5-hydroxytryptamine receptor 6
Ligand
BDBM50477471
Substrate
Meas. Tech.
ChEMBL_455689 (CHEMBL886472)
Ki
1.3±n/a nM
Citation
 Zhao, SHBerger, JClark, RDSethofer, SGKrauss, NEBrothers, JMMartin, RSMisner, DLSchwab, DAlexandrova, L 3,4-Dihydro-2H-benzo[1,4]oxazine derivatives as 5-HT6 receptor antagonists. Bioorg Med Chem Lett 17:3504-7 (2007)  
Target
Name:
5-hydroxytryptamine receptor 6
Synonyms:
5-HT-6 5-hydroxytryptamine receptor 6 (5-HT-6) 5-hydroxytryptamine receptor 6 (5HT6) HTR6 Serotonin 6 (5-HT6) receptor | Serotonin Receptor 6
Type:
G Protein-Coupled Receptor (GPCR)
Mol. Mass.:
46968.43
Organism:
Homo sapiens (Human)
Description:
P50406
Residue:
440
  
Inhibitor
Name:
BDBM50477471
Synonyms:
CHEMBL246917
Type:
Small organic molecule
Emp. Form.:
C18H21FN4O3S
Mol. Mass.:
392.448
SMILES:
Nc1ccc(cc1)S(=O)(=O)N1CCOc2c(cc(F)cc12)N1CCNCC1
: