Target
Cytochrome P450 11B1, mitochondrial
Ligand
BDBM50028164
Substrate
Meas. Tech.
ChEBML_192
IC50
87470±n/a nM
Citation
 Hays, SJTobes, MCGildersleeve, DLWieland, DMBeierwaltes, WH Structure-activity relationship study of the inhibition of adrenal cortical 11 beta-hydroxylase by new metyrapone analogues. J Med Chem 27:15-9 (1984)  
Target
Name:
Cytochrome P450 11B1, mitochondrial
Synonyms:
C11B1_BOVIN Cytochrome P450 11B1
Type:
PROTEIN
Mol. Mass.:
57863.81
Organism:
Bos taurus
Description:
ChEMBL_1345884
Residue:
503
  
Inhibitor
Name:
BDBM50028164
Synonyms:
CHEMBL57308 | N-(2-Methyl-1,2-di-pyridin-3-yl-propyl)-acetamide
Type:
Small organic molecule
Emp. Form.:
C16H19N3O
Mol. Mass.:
269.3416
SMILES:
CC(=O)NC(c1cccnc1)C(C)(C)c1cccnc1
: