Target
Presenilin-1
Ligand
BDBM50477945
Substrate
Meas. Tech.
ChEMBL_461557 (CHEMBL928698)
IC50
1.2±n/a nM
Citation
 Bergstrom, CPSloan, CPWang, HHParker, MFSmith, DWZheng, MHansel, SBPolson, CTBarber, LEBursuker, IGuss, VLCorsa, JABarten, DMFelsenstein, KMRoberts, SB Nitrogen-appended N-alkylsulfonamides as inhibitors of gamma-secretase. Bioorg Med Chem Lett 18:175-8 (2008)  
Target
Name:
Presenilin-1
Synonyms:
3.4.23.- Gamma-Secretase Subunit Presenilin-1 PS1 PSEN1 PSNL1 Presenilin-1 CTF12 Protein S182
Type:
Mol. Mass.:
52657.13
Organism:
Homo sapiens (Human)
Description:
P49768
Residue:
467
  
Inhibitor
Name:
BDBM50477945
Synonyms:
CHEMBL429838
Type:
Small organic molecule
Emp. Form.:
C19H21Cl2N5O3S
Mol. Mass.:
470.373
SMILES:
C[C@H](CCCn1ncnn1)N(c1cc(Cl)ccc1CO)S(=O)(=O)c1ccc(Cl)cc1
: