Target
cGMP-specific 3',5'-cyclic phosphodiesterase
Ligand
BDBM50028190
Substrate
Meas. Tech.
ChEBML_217497
Ki
600000±n/a nM
Citation
 Selvig, KRuud-Christensen, MAasen, AJ Optical resolution, absolute configuration, and activity of the enantiomers of proxyphylline. J Med Chem 26:1514-8 (1983)  
Target
Name:
cGMP-specific 3',5'-cyclic phosphodiesterase
Synonyms:
3',5'-cyclic phosphodiesterase PDE5 PDE5A_HUMAN Phosphodiesterase 5 (PDE5) Phosphodiesterase 5A (PDE5A) cGMP-specific 3',5'-cyclic phosphodiesterase
Type:
Protein
Mol. Mass.:
99975.83
Organism:
Homo sapiens (Human)
Description:
O76074
Residue:
875
  
Inhibitor
Name:
BDBM50028190
Synonyms:
7-(2-Hydroxy-propyl)-1,3-dimethyl-3,7-dihydro-purine-2,6-dione CHEMBL37390 Proxyphylline
Type:
Small organic molecule
Emp. Form.:
C10H14N4O3
Mol. Mass.:
238.2432
SMILES:
CC(O)Cn1cnc2n(C)c(=O)n(C)c(=O)c12
: