Target
Muscarinic acetylcholine receptor M2
Ligand
BDBM50064609
Substrate
Meas. Tech.
ChEMBL_470967 (CHEMBL923036)
Ki
2.6±n/a nM
Citation
 Vistoli, GPedretti, ADei, SScapecchi, SMarconi, CRomanelli, MN Docking analyses on human muscarinic receptors: unveiling the subtypes peculiarities in agonists binding. Bioorg Med Chem 16:3049-58 (2008)  
Target
Name:
Muscarinic acetylcholine receptor M2
Synonyms:
ACM2_HUMAN Cholinergic, muscarinic M2 Muscarinic acetylcholine receptor M2 and M5 | RecName: Full=Muscarinic acetylcholine receptor M2
Type:
GPCR
Mol. Mass.:
51730.61
Organism:
Homo sapiens (Human)
Description:
P08172
Residue:
466
  
Inhibitor
Name:
BDBM50064609
Synonyms:
6-acetoxy-8-azonia-bicyclo[3.2.1]octane CHEMBL64000
Type:
Small organic molecule
Emp. Form.:
C9H15NO2
Mol. Mass.:
169.2209
SMILES:
CC(=O)OC1CC2CCCC1N2
: