Target
Muscarinic acetylcholine receptor M2
Ligand
BDBM50003359
Substrate
Meas. Tech.
ChEMBL_470967 (CHEMBL923036)
Ki
12±n/a nM
Citation
 Vistoli, GPedretti, ADei, SScapecchi, SMarconi, CRomanelli, MN Docking analyses on human muscarinic receptors: unveiling the subtypes peculiarities in agonists binding. Bioorg Med Chem 16:3049-58 (2008)  
Target
Name:
Muscarinic acetylcholine receptor M2
Synonyms:
ACM2_HUMAN Cholinergic, muscarinic M2 Muscarinic acetylcholine receptor M2 and M5 | RecName: Full=Muscarinic acetylcholine receptor M2
Type:
GPCR
Mol. Mass.:
51730.61
Organism:
Homo sapiens (Human)
Description:
P08172
Residue:
466
  
Inhibitor
Name:
BDBM50003359
Synonyms:
5-(4-Hexyloxy-[1,2,5]thiadiazol-3-yl)-1-methyl-1,2,3,6-tetrahydro-pyridine; oxalic acid CHEMBL21536 LY 246708 | Xanomeline
Type:
Small organic molecule
Emp. Form.:
C14H23N3OS
Mol. Mass.:
281.417
SMILES:
CCCCCCOc1nsnc1C1=CCCN(C)C1
: