Target
DNA gyrase subunit B
Ligand
BDBM50478223
Substrate
Meas. Tech.
ChEMBL_473885 (CHEMBL921207)
IC50
75100±n/a nM
Citation
 Senthilkumar, PDinakaran, MBanerjee, DDevakaram, RVYogeeswari, PChina, ANagaraja, VSriram, D Synthesis and antimycobacterial evaluation of newer 1-cyclopropyl-1,4-dihydro-6-fluoro-7-(substituted secondary amino)-8-methoxy-5-(sub)-4-oxoquinoline-3-carboxylic acids. Bioorg Med Chem 16:2558-69 (2008)  
Target
Name:
DNA gyrase subunit B
Synonyms:
GYRB_MYCSM | gyrB
Type:
PROTEIN
Mol. Mass.:
74505.25
Organism:
Mycobacterium smegmatis
Description:
ChEMBL_107961
Residue:
675
  
Inhibitor
Name:
BDBM50478223
Synonyms:
CHEMBL261751
Type:
Small organic molecule
Emp. Form.:
C31H33FN2O5
Mol. Mass.:
532.6025
SMILES:
COc1ccc(CC2N(CCC3=C2CCCC3)c2c(F)cc3c(c2OC)n(cc(C(O)=O)c3=O)C2CC2)cc1
: