Target
UDP-3-O-acyl-N-acetylglucosamine deacetylase
Ligand
BDBM50200120
Substrate
Meas. Tech.
ChEMBL_478367 (CHEMBL931319)
Ki
3.0±n/a nM
Citation
 Barb, AWJiang, LRaetz, CRZhou, P Structure of the deacetylase LpxC bound to the antibiotic CHIR-090: Time-dependent inhibition and specificity in ligand binding. Proc Natl Acad Sci U S A 104:18433-8 (2007)  
Target
Name:
UDP-3-O-acyl-N-acetylglucosamine deacetylase
Synonyms:
3.5.1.108 UDP-3-O-acyl-GlcNAc deacetylase lpxC
Type:
PROTEIN
Mol. Mass.:
34415.56
Organism:
Rhizobium leguminosarum bv. trifolii (strain WSM1325)
Description:
ChEMBL_118424
Residue:
318
  
Inhibitor
Name:
BDBM50200120
Synonyms:
CHEMBL260091 US10875832, Compound ChIR-090
Type:
Small organic molecule
Emp. Form.:
C24H27N3O5
Mol. Mass.:
437.4883
SMILES:
C[C@@H](O)[C@H](NC(=O)c1ccc(cc1)C#Cc1ccc(CN2CCOCC2)cc1)C(=O)NO
: