Target
Prolyl endopeptidase
Ligand
BDBM50479022
Substrate
Meas. Tech.
ChEMBL_489692 (CHEMBL982997)
IC50
17±n/a nM
Citation
 Haffner, CDDiaz, CJMiller, ABReid, RAMadauss, KPHassell, AHanlon, MHPorter, DJBecherer, JDCarter, LH Pyrrolidinyl pyridone and pyrazinone analogues as potent inhibitors of prolyl oligopeptidase (POP). Bioorg Med Chem Lett 18:4360-3 (2008)  
Target
Name:
Prolyl endopeptidase
Synonyms:
PE POP PREP Prolyl oligopeptidase
Type:
Enzyme
Mol. Mass.:
80688.50
Organism:
Homo sapiens (Human)
Description:
P48147
Residue:
710
  
Inhibitor
Name:
BDBM50479022
Synonyms:
CHEMBL515786
Type:
Small organic molecule
Emp. Form.:
C20H21ClFN3O2
Mol. Mass.:
389.851
SMILES:
Fc1ccc(CNc2cc(Cl)c3CC[C@@H](C(=O)N4CCCC4)n3c2=O)cc1
: