Target
Type-1 angiotensin II receptor A
Ligand
BDBM50479154
Substrate
Meas. Tech.
ChEMBL_510120 (CHEMBL998774)
IC50
100000±n/a nM
Citation
 Ohno, OYe, MKoyama, TYazawa, KMura, EMatsumoto, HIchino, TYamada, KNakamura, KOhno, TYamaguchi, KIshida, JFukamizu, AUemura, D Inhibitory effects of benzyl benzoate and its derivatives on angiotensin II-induced hypertension. Bioorg Med Chem 16:7843-52 (2008)  
Target
Name:
Type-1 angiotensin II receptor A
Synonyms:
AGTRA_MOUSE Agtr1 Angiotensin II type-1A receptor | Type-1A angiotensin II receptor
Type:
PROTEIN
Mol. Mass.:
40876.47
Organism:
Mus musculus
Description:
ChEMBL_101531
Residue:
359
  
Inhibitor
Name:
BDBM50479154
Synonyms:
3-Methylbenzyl 3'',4''-Dihydroxybenzoate | CHEMBL447446
Type:
Small organic molecule
Emp. Form.:
C15H14O4
Mol. Mass.:
258.2693
SMILES:
Cc1cccc(COC(=O)c2ccc(O)c(O)c2)c1
: