Target
Pepsin A
Ligand
BDBM50028313
Substrate
Meas. Tech.
ChEBML_154165
Ki
0.045700±n/a nM
Citation
 Rich, DHSun, ETUlm, E Synthesis of analogues of the carboxyl protease inhibitor pepstatin. Effects of structure on inhibition of pepsin and renin. J Med Chem 23:27-33 (1980)  
Target
Name:
Pepsin A
Synonyms:
PEPA_PIG Pepsin | Pepsin A precursor
Type:
Enzyme
Mol. Mass.:
41232.87
Organism:
Porcine
Description:
Residue:
385
  
Inhibitor
Name:
BDBM50028313
Synonyms:
3-Hydroxy-6-methyl-4-{3-methyl-2-[3-methyl-2-(3-methyl-butyrylamino)-butyrylamino]-butyrylamino}-heptanoic acid {1-[1-(1,2-dihydroxy-ethyl)-3-methyl-butylcarbamoyl]-ethyl}-amide | CHEMBL322823
Type:
Small organic molecule
Emp. Form.:
C33H63N5O8
Mol. Mass.:
657.882
SMILES:
CC(C)CC(NC(=O)[C@@H](C)NC(=O)C[C@H](O)C(CC(C)C)NC(=O)[C@H](NC(=O)[C@H](NC(=O)CC(C)C)C(C)C)C(C)C)[C@@H](O)CO
: