Target
DNA polymerase III PolC-type
Ligand
BDBM50028333
Substrate
Meas. Tech.
ChEBML_52808
Ki
2190000±n/a nM
Citation
 Wright, GEBrown, NC Inhibitors of Bacillus subtilis DNA polymerase III. 6-Anilinouracils and 6-(alkylamino)uracils. J Med Chem 23:34-8 (1980)  
Target
Name:
DNA polymerase III PolC-type
Synonyms:
DNA polymerase III DNA-directed DNA polymerase PolIII mutI | polC
Type:
Enzyme
Mol. Mass.:
162625.67
Organism:
Bacillus subtilis
Description:
Enzyme was purified from recombinant strains.
Residue:
1437
  
Inhibitor
Name:
BDBM50028333
Synonyms:
6-(4-Butyl-phenylamino)-1H-pyrimidine-2,4-dione | CHEMBL54362
Type:
Small organic molecule
Emp. Form.:
C14H17N3O2
Mol. Mass.:
259.3037
SMILES:
CCCCc1ccc(Nc2cc(=O)[nH]c(=O)[nH]2)cc1
: