Target
DNA topoisomerase 3
Ligand
BDBM50028341
Substrate
Meas. Tech.
ChEBML_54508
Ki
630±n/a nM
Citation
 Wright, GEBrown, NC Inhibitors of Bacillus subtilis DNA polymerase III. 6-Anilinouracils and 6-(alkylamino)uracils. J Med Chem 23:34-8 (1980)  
Target
Name:
DNA topoisomerase 3
Synonyms:
DNA topoisomerase III topB
Type:
PROTEIN
Mol. Mass.:
81515.22
Organism:
Bacillus subtilis
Description:
ChEMBL_54525
Residue:
727
  
Inhibitor
Name:
BDBM50028341
Synonyms:
6-(3-Chloro-4-methyl-phenylamino)-1H-pyrimidine-2,4-dione | CHEMBL55145
Type:
Small organic molecule
Emp. Form.:
C11H10ClN3O2
Mol. Mass.:
251.669
SMILES:
Cc1ccc(Nc2cc(=O)[nH]c(=O)[nH]2)cc1Cl
: