Target
DNA gyrase subunit A/B
Ligand
BDBM50476065
Substrate
Meas. Tech.
ChEMBL_554861 (CHEMBL957238)
IC50
3200±n/a nM
Citation
 Cheng, JThanassi, JAThoma, CLBradbury, BJDeshpande, MPucci, MJ Dual targeting of DNA gyrase and topoisomerase IV: target interactions of heteroaryl isothiazolones in Staphylococcus aureus. Antimicrob Agents Chemother 51:2445-53 (2007)  
Target
Name:
DNA gyrase subunit A/B
Synonyms:
DNA Gyrase
Type:
A2B2 tetramer
Mol. Mass.:
Description:
Components:
This complex has 2 components.
Component 1
Name:
DNA gyrase subunit A
Synonyms:
DNA gyrase subunit A (gyrA) gyrA
Type:
Enzyme Subunit
Mol. Mass.:
99588.82
Organism:
Staphylococcus aureus
Description:
Residue:
889
  
Component 2
Name:
DNA gyrase subunit B
Synonyms:
DNA gyrase DNA gyrase subunit B (gyrB) gyrB
Type:
Enzyme Subunit
Mol. Mass.:
72530.91
Organism:
Staphylococcus aureus
Description:
Residue:
644
  
Inhibitor
Name:
BDBM50476065
Synonyms:
CHEMBL220656
Type:
Small organic molecule
Emp. Form.:
C21H18FN3O3S
Mol. Mass.:
411.449
SMILES:
COc1c(c(F)cc2c1n(C1CC1)c1s[nH]c(=O)c1c2=O)-c1cc(C)nc(C)c1
: