Target
Pepsin A
Ligand
BDBM50025519
Substrate
Meas. Tech.
ChEBML_154018
Ki
1.6±n/a nM
Citation
 Rich, DHBernatowicz, MS Synthesis of analogues of the carboxyl protease inhibitor pepstatin. Effect of structure in subsite P3 on inhibition of pepsin. J Med Chem 25:791-5 (1982)  
Target
Name:
Pepsin A
Synonyms:
PEPA_PIG Pepsin | Pepsin A precursor
Type:
Enzyme
Mol. Mass.:
41232.87
Organism:
Porcine
Description:
Residue:
385
  
Inhibitor
Name:
BDBM50025519
Synonyms:
4-[2-(2,2-Dimethyl-propionylamino)-3-methyl-butyrylamino]-3-hydroxy-6-methyl-heptanoic acid [1-(3-methyl-butylcarbamoyl)-ethyl]-amide CHEMBL165690
Type:
Small organic molecule
Emp. Form.:
C25H48N4O5
Mol. Mass.:
484.6724
SMILES:
CC(C)CCNC(=O)[C@H](C)NC(=O)C[C@H](O)[C@H](CC(C)C)NC(=O)[C@@H](NC(=O)C(C)C)C(C)C
: