Target
DNA gyrase subunit A/B
Ligand
BDBM50479685
Substrate
Meas. Tech.
ChEMBL_517105 (CHEMBL989568)
IC50
878±n/a nM
Citation
 Liu, XHZhu, JZhou, ANSong, BAZhu, HLBai, LSBhadury, PSPan, CX Synthesis, structure and antibacterial activity of new 2-(1-(2-(substituted-phenyl)-5-methyloxazol-4-yl)-3-(2-substitued-phenyl)-4,5-dihydro-1H-pyrazol-5-yl)-7-substitued-1,2,3,4-tetrahydroisoquinoline derivatives. Bioorg Med Chem 17:1207-13 (2009)  
Target
Name:
DNA gyrase subunit A/B
Synonyms:
DNA Gyrase
Type:
A2B2 tetramer
Mol. Mass.:
Description:
Components:
This complex has 2 components.
Component 1
Name:
DNA gyrase subunit A
Synonyms:
DNA gyrase subunit A (gyrA) gyrA
Type:
Enzyme Subunit
Mol. Mass.:
99588.82
Organism:
Staphylococcus aureus
Description:
Residue:
889
  
Component 2
Name:
DNA gyrase subunit B
Synonyms:
DNA gyrase DNA gyrase subunit B (gyrB) gyrB
Type:
Enzyme Subunit
Mol. Mass.:
72530.91
Organism:
Staphylococcus aureus
Description:
Residue:
644
  
Inhibitor
Name:
BDBM50479685
Synonyms:
CHEMBL474679
Type:
Small organic molecule
Emp. Form.:
C29H24Cl2F2N4O2
Mol. Mass.:
569.429
SMILES:
COc1ccc2CCN(Cc2c1)C1CC(=NN1c1nc(oc1C)-c1ccc(F)cc1F)c1ccc(Cl)cc1Cl
: