Target
Neuropeptide S receptor
Ligand
BDBM50479776
Substrate
Meas. Tech.
ChEMBL_492704 (CHEMBL938504)
EC50
240±n/a nM
Citation
 Camarda, VTrapella, CCalo', GGuerrini, RRizzi, ARuzza, CFiorini, SMarzola, EReinscheid, RKRegoli, DSalvadori, S Structure-activity study at positions 3 and 4 of human neuropeptide S. Bioorg Med Chem 16:8841-5 (2008)  
Target
Name:
Neuropeptide S receptor
Synonyms:
Gpr154 Npsr1 | Pgr14
Type:
PROTEIN
Mol. Mass.:
42447.53
Organism:
Mus musculus
Description:
ChEMBL_445691
Residue:
371
  
Inhibitor
Name:
BDBM50479776
Synonyms:
CHEMBL505996
Type:
Small organic molecule
Emp. Form.:
C90H149N29O28S
Mol. Mass.:
2117.389
SMILES:
CSCC[C@H](NC(=O)CNC(=O)[C@@H](NC(=O)CNC(=O)[C@@H](NC(=O)CNC(=O)[C@H](CC(N)=O)NC(=O)[C@H](CN)NC(=O)[C@H](Cc1ccccc1)NC(=O)[C@@H](N)CO)C(C)C)[C@@H](C)O)C(=O)N[C@@H](CCCCN)C(=O)N[C@@H](CCCCN)C(=O)N[C@@H]([C@@H](C)O)C(=O)N[C@@H](CO)C(=O)N[C@@H](Cc1ccccc1)C(=O)N[C@@H](CCC(N)=O)C(=O)N[C@@H](CCCNC(N)=N)C(=O)N[C@@H](C)C(=O)N[C@@H](CCCCN)C(=O)N[C@@H](CO)C(O)=O
: