Target
Protein farnesyltransferase subunit beta/geranylgeranyltransferase type-1 subunit alpha
Ligand
BDBM50479863
Substrate
Meas. Tech.
ChEMBL_566968 (CHEMBL964904)
IC50
0.800000±n/a nM
Citation
 Asoh, KKohchi, MHyoudoh, IOhtsuka, TMasubuchi, MKawasaki, KEbiike, HShiratori, YFukami, TAKondoh, OTsukaguchi, TIshii, NAoki, YShimma, NSakaitani, M Synthesis and structure-activity relationships of novel benzofuran farnesyltransferase inhibitors. Bioorg Med Chem Lett 19:1753-7 (2009)  
Target
Name:
Protein farnesyltransferase subunit beta/geranylgeranyltransferase type-1 subunit alpha
Synonyms:
Farnesyltransferase (FTase) Protein Farnesyltransferase (PFT) Chain B | Protein farnesyltransferase
Type:
Protein Complex
Mol. Mass.:
Description:
To express recombinant enzyme in E. coli, the cloned human alpha and beta subunits were co-expressed from a plasmid, in which their expression was translationally coupled.
Components:
This complex has 2 components.
Component 1
Name:
Protein farnesyltransferase subunit beta
Synonyms:
CAAX farnesyltransferase subunit alpha FNTB FTase-alpha GGTase-I-alpha Protein farnesyl/geranylgeranyl transferase Protein farnesyltransferase subunit beta Protein farnesyltransferase/geranylgeranyltransferase type-1 subunit alpha Ras proteins prenyltransferase subunit beta | Type I protein geranyl-geranyltransferase subunit alpha
Type:
Enzyme Subunit
Mol. Mass.:
48766.02
Organism:
Homo sapiens (Human)
Description:
Protein farnesyltransferase subunit beta
Residue:
437
  
Component 2
Name:
Protein farnesyltransferase/geranylgeranyltransferase type-1 subunit alpha
Synonyms:
CAAX farnesyltransferase alpha subunit FNTA_HUMAN FTase-alpha Geranylgeranyl Transferase (GGTase-I) Chain A Protein Farnesyltransferase (PFT) Chain A Protein farnesyltransferase Protein farnesyltransferase/geranylgeranyltransferase type I alpha subunit | Ras proteins prenyltransferase alpha
Type:
Enzyme
Mol. Mass.:
44392.46
Organism:
Homo sapiens (Human)
Description:
Recombinant human FTase.
Residue:
379
  
Inhibitor
Name:
BDBM50479863
Synonyms:
CHEMBL521743
Type:
Small organic molecule
Emp. Form.:
C27H21N5O4
Mol. Mass.:
479.4867
SMILES:
COc1cccc(c1)-c1cc(cc2cc(oc12)[C@@](N)(c1cncn1C)c1ccc(cc1)C#N)[N+]([O-])=O
: