Target
Phenylalanine-4-hydroxylase
Ligand
BDBM50028431
Substrate
Meas. Tech.
ChEBML_154856
Ki
400000±n/a nM
Citation
 Henrie, RNLazarus, RABenkovic, SJ Preparation of 2-amino-4(3H)-oxopyrimido[5,4-b] [1,4]thiazines (5-thiapterins) and their evaluation as cofactors for phenylalanine hydroxylase. J Med Chem 26:559-63 (1983)  
Target
Name:
Phenylalanine-4-hydroxylase
Synonyms:
PH4H_RAT Phe-4-monooxygenase
Type:
PROTEIN
Mol. Mass.:
51817.61
Organism:
Rattus norvegicus
Description:
ChEMBL_154856
Residue:
453
  
Inhibitor
Name:
BDBM50028431
Synonyms:
2-Amino-5-oxo-5,6,7,8-tetrahydro-3H-5lambda*4*-pyrimido[5,4-b][1,4]thiazin-4-one | CHEMBL345482
Type:
Small organic molecule
Emp. Form.:
C6H6N4O2S
Mol. Mass.:
198.202
SMILES:
Nc1nc2NC=CS(=O)c2c(=O)[nH]1
: