Target
Reverse transcriptase
Ligand
BDBM25525
Substrate
Meas. Tech.
ChEMBL_545151 (CHEMBL1018093)
IC50
<451000±n/a nM
Citation
 Tan, GTPezzuto, JMKinghorn, ADHughes, SH Evaluation of natural products as inhibitors of human immunodeficiency virus type 1 (HIV-1) reverse transcriptase. J Nat Prod 54:143-54 
Target
Name:
Reverse transcriptase
Synonyms:
Type:
Protein
Mol. Mass.:
29598.37
Organism:
Human immunodeficiency virus 1
Description:
Q9WKE8
Residue:
254
  
Inhibitor
Name:
BDBM25525
Synonyms:
24-methyl-5,7,18,20-tetraoxa-24-azahexacyclo[11.11.0.0^{2,10}.0^{4,8}.0^{14,22}.0^{17,21}]tetracosa-1(13),2,4(8),9,11,14(22),15,17(21),23-nonaen-24-ium Pseudochelerythrine cid_5154 sangvinarin
Type:
Small organic molecule
Emp. Form.:
C20H14NO4
Mol. Mass.:
332.3289
SMILES:
C[n+]1cc2c3OCOc3ccc2c2ccc3cc4OCOc4cc3c12
: