Target
Reverse transcriptase
Ligand
BDBM50370521
Substrate
Meas. Tech.
ChEMBL_545151 (CHEMBL1018093)
IC50
>364000±n/a nM
Citation
 Tan, GTPezzuto, JMKinghorn, ADHughes, SH Evaluation of natural products as inhibitors of human immunodeficiency virus type 1 (HIV-1) reverse transcriptase. J Nat Prod 54:143-54 
Target
Name:
Reverse transcriptase
Synonyms:
Type:
Protein
Mol. Mass.:
29598.37
Organism:
Human immunodeficiency virus 1
Description:
Q9WKE8
Residue:
254
  
Inhibitor
Name:
BDBM50370521
Synonyms:
BRUCEANTIN
Type:
Small organic molecule
Emp. Form.:
C28H36O11
Mol. Mass.:
548.5788
SMILES:
COC(=O)[C@]12OC[C@@]34[C@H]1[C@@H](OC(=O)\C=C(/C)C(C)C)C(=O)O[C@@H]3C[C@H]1C(C)C(=O)C(=O)C[C@]1(C)[C@H]4[C@@H](O)[C@@H]2O
: