Target
Reverse transcriptase
Ligand
BDBM50480275
Substrate
Meas. Tech.
ChEMBL_545151 (CHEMBL1018093)
IC50
>633000±n/a nM
Citation
 Tan, GTPezzuto, JMKinghorn, ADHughes, SH Evaluation of natural products as inhibitors of human immunodeficiency virus type 1 (HIV-1) reverse transcriptase. J Nat Prod 54:143-54 
Target
Name:
Reverse transcriptase
Synonyms:
Type:
Protein
Mol. Mass.:
29598.37
Organism:
Human immunodeficiency virus 1
Description:
Q9WKE8
Residue:
254
  
Inhibitor
Name:
BDBM50480275
Synonyms:
Panamine
Type:
Small organic molecule
Emp. Form.:
C20H33N3
Mol. Mass.:
315.4961
SMILES:
[H][C@@]12CCC[C@]([H])(N1)[C@@]13CN4CCCC[C@]4([H])[C@@]([H])(C[C@]4([H])CCCN2[C@@]14[H])C3
: