Target
Reverse transcriptase
Ligand
BDBM50226670
Substrate
Meas. Tech.
ChEMBL_545151 (CHEMBL1018093)
IC50
209000±n/a nM
Citation
 Tan, GTPezzuto, JMKinghorn, ADHughes, SH Evaluation of natural products as inhibitors of human immunodeficiency virus type 1 (HIV-1) reverse transcriptase. J Nat Prod 54:143-54 
Target
Name:
Reverse transcriptase
Synonyms:
Type:
Protein
Mol. Mass.:
29598.37
Organism:
Human immunodeficiency virus 1
Description:
Q9WKE8
Residue:
254
  
Inhibitor
Name:
BDBM50226670
Synonyms:
CHEMBL251055 | jatrorrhizine
Type:
Small organic molecule
Emp. Form.:
C20H20NO4
Mol. Mass.:
338.3766
SMILES:
COc1cc-2c(CC[n+]3cc4c(OC)c(OC)ccc4cc-23)cc1O
: