Target
Reverse transcriptase
Ligand
BDBM84983
Substrate
Meas. Tech.
ChEMBL_545151 (CHEMBL1018093)
IC50
>636000±n/a nM
Citation
 Tan, GTPezzuto, JMKinghorn, ADHughes, SH Evaluation of natural products as inhibitors of human immunodeficiency virus type 1 (HIV-1) reverse transcriptase. J Nat Prod 54:143-54 
Target
Name:
Reverse transcriptase
Synonyms:
Type:
Protein
Mol. Mass.:
29598.37
Organism:
Human immunodeficiency virus 1
Description:
Q9WKE8
Residue:
254
  
Inhibitor
Name:
BDBM84983
Synonyms:
Velutin
Type:
Small organic molecule
Emp. Form.:
C17H14O6
Mol. Mass.:
314.2895
SMILES:
COc1cc(O)c2c(c1)oc(cc2=O)-c1ccc(O)c(OC)c1
: