Target
Acetyl-CoA carboxylase 2
Ligand
BDBM50480668
Substrate
Meas. Tech.
ChEMBL_577818 (CHEMBL1055469)
Kd
3.0±n/a nM
Citation
 Raymer, BKavana, MPrice, AWang, BCorcoran, LKulathila, RGroarke, JMann, T Synthesis and characterization of a BODIPY-labeled derivative of Soraphen A that binds to acetyl-CoA carboxylase. Bioorg Med Chem Lett 19:2804-7 (2009)  
Target
Name:
Acetyl-CoA carboxylase 2
Synonyms:
ACACB ACC-beta ACCB Acetyl-CoA carboxylase 2 Acetyl-CoA carboxylase 2 (ACC2)
Type:
Protein
Mol. Mass.:
276535.21
Organism:
Homo sapiens (Human)
Description:
O00763
Residue:
2458
  
Inhibitor
Name:
BDBM50480668
Synonyms:
CHEMBL540678
Type:
Small organic molecule
Emp. Form.:
C42H55BF2N2O9
Mol. Mass.:
780.702
SMILES:
[H][C@@]12O[C@@](O)([C@H](OC)[C@@H](O)[C@@H]1C)[C@H](C)C(=O)O[C@@H](CCCC[C@H](OC)[C@H](OC(=O)CCC1=[N+]3C(C=C1)=Cc1c(C)cc(C)n1[B-]3(F)F)\C=C\[C@@H]2C)c1ccccc1
: