Target
Catalase
Ligand
BDBM50458513
Substrate
Meas. Tech.
ChEMBL_589122 (CHEMBL1038475)
EC50
3430±n/a nM
Citation
 Koteswara Rao, VJanardhan Rao, ASubba Reddy, SNaga Raju, CVisweswara Rao, PGhosh, SK Synthesis, spectral characterization and biological evaluation of phosphorylated derivatives of galanthamine. Eur J Med Chem 45:203-9 (2010)  
Target
Name:
Catalase
Synonyms:
1.11.1.6 Cas1 Catalase
Type:
PROTEIN
Mol. Mass.:
59766.07
Organism:
Rattus norvegicus
Description:
ChEMBL_102912
Residue:
527
  
Inhibitor
Name:
BDBM50458513
Synonyms:
Alpha Tocopherol CHEBI:18145 Tocopherol | Vitamin E
Type:
Small organic molecule
Emp. Form.:
C29H50O2
Mol. Mass.:
430.7061
SMILES:
CC(C)CCC[C@@H](C)CCC[C@@H](C)CCC[C@]1(C)CCc2c(C)c(O)c(C)c(C)c2O1
: