Target
Protease
Ligand
BDBM580
Substrate
Meas. Tech.
ChEMBL_593880 (CHEMBL1037773)
Ki
0.031000±n/a nM
Citation
 Hidaka, KKimura, TAbdel-Rahman, HMNguyen, JTMcDaniel, KFKohlbrenner, WEMolla, AAdachi, MTamada, TKuroki, RKatsuki, NTanaka, YMatsumoto, HWang, JHayashi, YKempf, DJKiso, Y Small-sized human immunodeficiency virus type-1 protease inhibitors containing allophenylnorstatine to explore the S2' pocket. J Med Chem 52:7604-17 (2009)  
Target
Name:
Protease
Synonyms:
Type:
Enzyme
Mol. Mass.:
10904.79
Organism:
Human immunodeficiency virus 1 (HIV-1)
Description:
Q9YQ12
Residue:
99
  
Inhibitor
Name:
BDBM580
Synonyms:
(4R)-3-[(2S,3S)-2-hydroxy-3-[(3-hydroxy-2-methylphenyl)formamido]-4-phenylbutanoyl]-5,5-dimethyl-N-[(2-methylphenyl)methyl]-1,3-thiazolidine-4-carboxamide BDBM50288366 KNI-764
Type:
Small organic molecule
Emp. Form.:
C32H37N3O5S
Mol. Mass.:
575.718
SMILES:
Cc1ccccc1CNC(=O)[C@H]1N(CSC1(C)C)C(=O)[C@@H](O)[C@H](Cc1ccccc1)NC(=O)c1cccc(O)c1C
: