Target
Presenilin-1
Ligand
BDBM50481164
Substrate
Meas. Tech.
ChEMBL_594636 (CHEMBL1037933)
IC50
1.000000±n/a nM
Citation
 Bowers, SProbst, GDTruong, APHom, RKKonradi, AWSham, HLGarofalo, AWWong, KGoldbach, EQuinn, KPSauer, JMWallace, WNguyen, LHemphill, SSBova, MPBasi, GS N-Bridged bicyclic sulfonamides as inhibitors of gamma-secretase. Bioorg Med Chem Lett 19:6952-6 (2009)  
Target
Name:
Presenilin-1
Synonyms:
3.4.23.- Gamma-Secretase Subunit Presenilin-1 PS1 PSEN1 PSNL1 Presenilin-1 CTF12 Protein S182
Type:
Mol. Mass.:
52657.13
Organism:
Homo sapiens (Human)
Description:
P49768
Residue:
467
  
Inhibitor
Name:
BDBM50481164
Synonyms:
CHEMBL585911
Type:
Small organic molecule
Emp. Form.:
C18H17ClF3N3O2S
Mol. Mass.:
431.86
SMILES:
FC(F)(F)\C=C\C1CC2Cc3[nH]ncc3C(C1)N2S(=O)(=O)c1ccc(Cl)cc1
: