Target
Cyclin-dependent kinase 2/G1/S-specific cyclin-E1
Ligand
BDBM50481284
Substrate
Meas. Tech.
ChEMBL_604955 (CHEMBL1067901)
IC50
1750±n/a nM
Citation
 Horiuchi, TNagata, MKitagawa, MAkahane, KUoto, K Discovery of novel thieno[2,3-d]pyrimidin-4-yl hydrazone-based inhibitors of cyclin D1-CDK4: synthesis, biological evaluation and structure-activity relationships. Part 2. Bioorg Med Chem 17:7850-60 (2009)  
Target
Name:
Cyclin-dependent kinase 2/G1/S-specific cyclin-E1
Synonyms:
CDK2/CycE CDK2/E Cyclin-Dependent Kinase 2 (CDK2) Cyclin-dependent kinase 2/cyclin E1
Type:
Protein
Mol. Mass.:
Description:
Components:
This complex has 2 components.
Component 1
Name:
Cyclin-dependent kinase 2
Synonyms:
CDK2 CDK2_HUMAN Cell division protein kinase 2 Protein cereblon/Cyclin-dependent kinase 2 | p33 protein kinase
Type:
Enzyme Subunit
Mol. Mass.:
33938.17
Organism:
Homo sapiens (Human)
Description:
P24941
Residue:
298
  
Component 2
Name:
G1/S-specific cyclin-E1
Synonyms:
CCNE CCNE1_HUMAN
Type:
Enzyme Subunit
Mol. Mass.:
47073.17
Organism:
Homo sapiens (Human)
Description:
Residue:
410
  
Inhibitor
Name:
BDBM50481284
Synonyms:
CHEMBL594349
Type:
Small organic molecule
Emp. Form.:
C20H23N5S
Mol. Mass.:
365.495
SMILES:
CC(C)(C)c1cc2c(N\N=C\c3ccc4CNCCc4c3)ncnc2s1
: