Target
Cyclin-dependent kinase 4/G1/S-specific cyclin-D1
Ligand
BDBM50481280
Substrate
Meas. Tech.
ChEMBL_604954 (CHEMBL1067900)
IC50
1170±n/a nM
Citation
 Horiuchi, TNagata, MKitagawa, MAkahane, KUoto, K Discovery of novel thieno[2,3-d]pyrimidin-4-yl hydrazone-based inhibitors of cyclin D1-CDK4: synthesis, biological evaluation and structure-activity relationships. Part 2. Bioorg Med Chem 17:7850-60 (2009)  
Target
Name:
Cyclin-dependent kinase 4/G1/S-specific cyclin-D1
Synonyms:
CDK4/CycD CDK4/Cyclin D1 Cyclin-Dependent Kinase 4 (CDK4) Cyclin-dependent kinase 4/G1/S-specific cyclin D1 | Cyclin-dependent kinase 4/cyclin D1
Type:
Protein Complex
Mol. Mass.:
Description:
CDK4/D1 complexes were purified from insect cells co-infected with baculovirus vectors containing each of the components.
Components:
This complex has 2 components.
Component 1
Name:
Cyclin-dependent kinase 4
Synonyms:
CDK4 Cell division protein kinase 4 PSK-J3
Type:
Enzyme Subunit
Mol. Mass.:
33731.96
Organism:
Homo sapiens (Human)
Description:
P11802
Residue:
303
  
Component 2
Name:
G1/S-specific cyclin-D1
Synonyms:
B-cell lymphoma 1 protein BCL-1 oncogene CCND1 PRAD1 | PRAD1 oncogene
Type:
Enzyme Subunit
Mol. Mass.:
33717.70
Organism:
Homo sapiens (Human)
Description:
Residue:
295
  
Inhibitor
Name:
BDBM50481280
Synonyms:
CHEMBL607544
Type:
Small organic molecule
Emp. Form.:
C18H20N4OS
Mol. Mass.:
340.443
SMILES:
CC(C)(C)c1cc2c(N\N=C\c3ccc(CO)cc3)ncnc2s1
: