Target
Alpha-tocopherol transfer protein
Ligand
BDBM50458513
Substrate
Meas. Tech.
ChEMBL_605568 (CHEMBL1069214)
Kd
2420±n/a nM
Citation
 López, GVGómez, LECampillo, NPáez, JAGiles, KAtkinson, JGonzález, MRubbo, HCerecetto, H Interaction studies between human alpha-tocopherol transfer protein and nitric oxide donor tocopherol analogues with LDL-protective activity. Bioorg Med Chem 17:8143-8 (2009)  
Target
Name:
Alpha-tocopherol transfer protein
Synonyms:
Alpha-TTP TPP1 TTPA_HUMAN
Type:
PROTEIN
Mol. Mass.:
31754.31
Organism:
Homo sapiens
Description:
ChEMBL_109106
Residue:
278
  
Inhibitor
Name:
BDBM50458513
Synonyms:
Alpha Tocopherol CHEBI:18145 Tocopherol | Vitamin E
Type:
Small organic molecule
Emp. Form.:
C29H50O2
Mol. Mass.:
430.7061
SMILES:
CC(C)CCC[C@@H](C)CCC[C@@H](C)CCC[C@]1(C)CCc2c(C)c(O)c(C)c(C)c2O1
: